Target
Mitogen-activated protein kinase 1 [8-360]
Ligand
BDBM192347
Substrate
Meas. Tech.
Enzymatic Assay
pH
7.3±n/a
IC50
15.8±n/a nM
Comments
extracted
Citation
 Blake, JFChen, HChicarelli, MJDemeese, JGarrey, RFGaudino, JGazzard, LKaus, RJKintz, SMohr, PJMoreno, DASchwarz, JSiedem, CSWallace, EM Substituted quinazolines as serine/threonine kinase inhibitors US Patent  US9187462 Publication Date 11/17/2015 
Target
Name:
Mitogen-activated protein kinase 1 [8-360]
Synonyms:
ERK2 MAPK1 Mitogen Activated Kinase 1 Mitogen-activated protein kinase 1 (aa 8-360) PRKM2
Type:
Mol. Mass.:
40835.09
Organism:
Homo sapiens (Human)
Description:
P28482 aa 8-360
Residue:
353
  
Inhibitor
Name:
BDBM192347
Synonyms:
US9187462, I-27
Type:
Small organic molecule
Emp. Form.:
C25H23ClF2N6O2
Mol. Mass.:
512.939
SMILES:
Cn1cc(cn1)[C@@H](NC(=O)c1ccc2cnc(N[C@@H]3CCOC[C@@H]3F)nc2c1)c1ccc(Cl)c(F)c1
: