Target
Serine/threonine-protein kinase B-raf
Ligand
BDBM192503
Substrate
Meas. Tech.
KiNativ assay
IC50
35±n/a nM
Citation
 Flynn, DLKaufman, MDVogeti, LWise, SLu, WSmith, BCaldwell, TMPatt, WCHenry, JRHipskind, PAPeng, S Raf inhibitor compounds US Patent  US9187474 Publication Date 11/17/2015 
Target
Name:
Serine/threonine-protein kinase B-raf
Synonyms:
B-RAF B-Raf proto-oncogene serine/threonine-protein kinase BRAF1 RAFB1 v-Raf murine sarcoma viral oncogene homolog B1
Type:
Serine/threonine-protein kinase
Mol. Mass.:
84446.00
Organism:
Homo sapiens (Human)
Description:
P15056
Residue:
766
  
Inhibitor
Name:
BDBM192503
Synonyms:
US9187474, 18
Type:
Small organic molecule
Emp. Form.:
C23H28FN5O
Mol. Mass.:
409.4997
SMILES:
CNc1cc2nc(C)c(cc2cn1)-c1cc(NC(=O)NCCC(C)(C)C)ccc1F
: