Target
5'-AMP-activated protein kinase catalytic subunit alpha-1
Ligand
BDBM192505
Substrate
Meas. Tech.
AMPK Activation Assay
pH
7±n/a
EC50
1.2±n/a nM
Citation
 Wagner, HHimmelsbach, F Azabenzimidazole derivatives US Patent  US9187477 Publication Date 11/17/2015 
Target
Name:
5'-AMP-activated protein kinase catalytic subunit alpha-1
Synonyms:
AAPK1_HUMAN AMP-activated protein kinase alpha-1/beta-2/gamma-2 AMPK subunit alpha-1 AMPK1 PRKAA1 | Tau-protein kinase PRKAA1
Type:
Protein
Mol. Mass.:
64023.62
Organism:
Homo sapiens (Human)
Description:
Q13131
Residue:
559
  
Inhibitor
Name:
BDBM192505
Synonyms:
US9187477, 1
Type:
Small organic molecule
Emp. Form.:
C27H32ClN5O5
Mol. Mass.:
542.026
SMILES:
CCCC(=O)NC1CCN(CC1)c1ccc(cc1)-c1nc2[nH]c(O[C@@H]3COC4[C@H](O)COC34)nc2cc1Cl
: