Target
5'-AMP-activated protein kinase catalytic subunit alpha-1
Ligand
BDBM192519
Substrate
Meas. Tech.
AMPK Activation Assay
pH
7±n/a
EC50
133±n/a nM
Citation
 Wagner, HHimmelsbach, F Azabenzimidazole derivatives US Patent  US9187477 Publication Date 11/17/2015 
Target
Name:
5'-AMP-activated protein kinase catalytic subunit alpha-1
Synonyms:
AAPK1_HUMAN AMP-activated protein kinase alpha-1/beta-2/gamma-2 AMPK subunit alpha-1 AMPK1 PRKAA1 | Tau-protein kinase PRKAA1
Type:
Protein
Mol. Mass.:
64023.62
Organism:
Homo sapiens (Human)
Description:
Q13131
Residue:
559
  
Inhibitor
Name:
BDBM192519
Synonyms:
US9187477, 15
Type:
Small organic molecule
Emp. Form.:
C28H32ClN5O7
Mol. Mass.:
586.036
SMILES:
O[C@@H]1COC2[C@@H](COC12)Oc1nc2cc(Cl)c(nc2[nH]1)-c1ccc(cc1)N1CCC(CC1)OC(=O)N1CCOCC1
: