Target
Phosphatidylinositol 4,5-bisphosphate 3-kinase catalytic subunit delta isoform
Ligand
BDBM255798
Substrate
Meas. Tech.
PI3K delta Scintillation Proximity Assay
pH
6.7±n/a
Temperature
298.15±n/a K
IC50
<10±n/a nM
Comments
extracted
Citation
 Li, YYao, WCombs, APYue, EWMei, SZhu, WGlenn, JMaduskuie, Jr., TPSparks, RBDouty, BHe, C Heterocyclylamines as PI3K inhibitors US Patent  US10092570 Publication Date 10/9/2018 
Target
Name:
Phosphatidylinositol 4,5-bisphosphate 3-kinase catalytic subunit delta isoform
Synonyms:
PI3-kinase p110 subunit delta PI3-kinase subunit p110-delta PIK3CD Phosphatidylinositol 4,5-biphosphate 3-kinase catalytic subunit delta (PIK3CD) Phosphatidylinositol 4,5-bisphosphate 3-kinase 110 kDa catalytic subunit delta (PI3K delta) Phosphatidylinositol 4,5-bisphosphate 3-kinase catalytic subunit delta (PI3Kdelta) Phosphatidylinositol 4,5-bisphosphate 3-kinase catalytic subunit delta isoform (PI3K delta) Phosphatidylinositol 4,5-bisphosphate 3-kinase catalytic subunit delta isoform (PI3K-delta) Phosphatidylinositol 4,5-bisphosphate 3-kinase catalytic subunit delta isoform (PI3Kdelta)
Type:
Enzyme Subunit
Mol. Mass.:
119489.41
Organism:
Homo sapiens (Human)
Description:
O00329
Residue:
1044
  
Inhibitor
Name:
BDBM255798
Synonyms:
1-(1-{5-Chloro-2-methoxy-3-[1-(2-methoxyethyl)azetidin-3-yl]-4-methylphenyl}ethyl)-3-methyl-1H-pyrazolo[3,4-d]pyrimidin-4-amine US10376513, Example 9 US11433071, Example 9 US9730939, Example 9 | US9932341, Example 9
Type:
Small organic molecule
Emp. Form.:
C22H29ClN6O2
Mol. Mass.:
444.958
SMILES:
COCCN1CC(C1)c1c(C)c(Cl)cc(C(C)n2nc(C)c3c(N)ncnc23)c1OC
: