Target
Phosphatidylinositol 4,5-bisphosphate 3-kinase catalytic subunit delta isoform
Ligand
BDBM261267
Substrate
Meas. Tech.
PI3K delta Scintillation Proximity Assay
pH
6.7±n/a
Temperature
298.15±n/a K
IC50
<10±n/a nM
Comments
extracted
Citation
 Li, YYao, WCombs, APYue, EWMei, SZhu, WGlenn, JMaduskuie, Jr., TPSparks, RBDouty, BHe, C Heterocyclylamines as PI3K inhibitors US Patent  US10092570 Publication Date 10/9/2018 
Target
Name:
Phosphatidylinositol 4,5-bisphosphate 3-kinase catalytic subunit delta isoform
Synonyms:
PI3-kinase p110 subunit delta PI3-kinase subunit p110-delta PIK3CD Phosphatidylinositol 4,5-biphosphate 3-kinase catalytic subunit delta (PIK3CD) Phosphatidylinositol 4,5-bisphosphate 3-kinase 110 kDa catalytic subunit delta (PI3K delta) Phosphatidylinositol 4,5-bisphosphate 3-kinase catalytic subunit delta (PI3Kdelta) Phosphatidylinositol 4,5-bisphosphate 3-kinase catalytic subunit delta isoform (PI3K delta) Phosphatidylinositol 4,5-bisphosphate 3-kinase catalytic subunit delta isoform (PI3K-delta) Phosphatidylinositol 4,5-bisphosphate 3-kinase catalytic subunit delta isoform (PI3Kdelta)
Type:
Enzyme Subunit
Mol. Mass.:
119489.41
Organism:
Homo sapiens (Human)
Description:
O00329
Residue:
1044
  
Inhibitor
Name:
BDBM261267
Synonyms:
US10092570, Example 290 US11433071, Example 290 US9730939, Example 290
Type:
Small organic molecule
Emp. Form.:
C22H24ClN7O3
Mol. Mass.:
469.924
SMILES:
CCOC(=O)N1CC(C1)c1c(OC)c(cc(Cl)c1C#N)C(C)n1nc(C)c2c(N)ncnc12
: