Target
Cathepsin B
Ligand
BDBM192668
Substrate
Meas. Tech.
Proteolytic Activity Assay
pH
5±0
Temperature
310.15±0 K
Ki
664±0.0 nM
Citation
 Garg, SRaghav, N 2,5-Diaryloxadiazoles and their precursors as novel inhibitors of cathepsins B, H and L. Bioorg Chem 67:64-74 (2016)  
Target
Name:
Cathepsin B
Synonyms:
Type:
Protein
Mol. Mass.:
36777.57
Organism:
Capra hircus (Goat)
Description:
Residue:
335
  
Inhibitor
Name:
BDBM192668
Synonyms:
2-phenyl-5-(4-nitrophenyl)-1,3,4-oxadiazole (2k)
Type:
Small organic molecule
Emp. Form.:
C14H9N3O3
Mol. Mass.:
267.2396
SMILES:
[O-][N+](=O)c1ccc(cc1)-c1nnc(o1)-c1ccccc1
: