Target
Cathepsin H
Ligand
BDBM192662
Substrate
Meas. Tech.
Proteolytic Activity Assay
pH
5±0
Temperature
310.15±0 K
Ki
560±0.0 nM
Citation
 Garg, SRaghav, N 2,5-Diaryloxadiazoles and their precursors as novel inhibitors of cathepsins B, H and L. Bioorg Chem 67:64-74 (2016)  
Target
Name:
Cathepsin H
Synonyms:
Type:
Protein
Mol. Mass.:
37394.24
Organism:
Capra hircus (Goat)
Description:
A0A060INS8
Residue:
335
  
Inhibitor
Name:
BDBM192662
Synonyms:
2-phenyl-5-(2-chlorophenyl)-1,3,4-oxadiazole (2c)
Type:
Small organic molecule
Emp. Form.:
C14H9ClN2O
Mol. Mass.:
256.687
SMILES:
Clc1ccccc1-c1nnc(o1)-c1ccccc1
: