Target
Cathepsin L
Ligand
BDBM192667
Substrate
Meas. Tech.
Proteolytic Activity Assay
pH
5±0
Temperature
310.15±0 K
Ki
57±0.0 nM
Citation
 Garg, SRaghav, N 2,5-Diaryloxadiazoles and their precursors as novel inhibitors of cathepsins B, H and L. Bioorg Chem 67:64-74 (2016)  
Target
Name:
Cathepsin L
Synonyms:
Type:
Mol. Mass.:
37231.51
Organism:
Capra hircus (Goat)
Description:
Residue:
334
  
Inhibitor
Name:
BDBM192667
Synonyms:
2-phenyl-5-(2-nitrophenyl)-1,3,4-oxadiazole (2i)
Type:
Small organic molecule
Emp. Form.:
C14H9N3O3
Mol. Mass.:
267.2396
SMILES:
[O-][N+](=O)c1ccccc1-c1nnc(o1)-c1ccccc1
: