Target
Gag-Pol polyprotein
Ligand
BDBM192679
Substrate
Meas. Tech.
HIV-1 RT Colorimetric Assay
IC50
2.491e+4±n/a nM
Citation
 Chander, SWang, PAshok, PYang, LMZheng, YTMurugesan, S Rational design, synthesis, anti-HIV-1 RT and antimicrobial activity of novel 3-(6-methoxy-3,4-dihydroquinolin-1(2H)-yl)-1-(piperazin-1-yl)propan-1-one derivatives. Bioorg Chem 67:75-83 (2016)  
Target
Name:
Gag-Pol polyprotein
Synonyms:
HIV-1 reverse transcriptase (HIV-1 RT) POL_HV1H2 Protease Reverse transcriptase (RT) gag-pol p66 RT
Type:
Protein
Mol. Mass.:
162074.74
Organism:
Human immunodeficiency virus type 1 group M subtype B (isolate HXB2)
Description:
P04585
Residue:
1435
  
Inhibitor
Name:
BDBM192679
Synonyms:
1-(4-(4-chlorophenyl)piperazin-1-yl)-3-(6-methoxy-3,4-dihydroquinolin-1(2H)-yl)propan-1-one (6k)
Type:
Small organic molecule
Emp. Form.:
C23H28ClN3O2
Mol. Mass.:
413.94
SMILES:
COc1ccc2N(CCC(=O)N3CCN(CC3)c3ccc(Cl)cc3)CCCc2c1
: