Target
Gag-Pol polyprotein
Ligand
BDBM192680
Substrate
Meas. Tech.
HIV-1 RT Colorimetric Assay
IC50
8.268e+4±n/a nM
Citation
 Chander, SWang, PAshok, PYang, LMZheng, YTMurugesan, S Rational design, synthesis, anti-HIV-1 RT and antimicrobial activity of novel 3-(6-methoxy-3,4-dihydroquinolin-1(2H)-yl)-1-(piperazin-1-yl)propan-1-one derivatives. Bioorg Chem 67:75-83 (2016)  
Target
Name:
Gag-Pol polyprotein
Synonyms:
HIV-1 reverse transcriptase (HIV-1 RT) POL_HV1H2 Protease Reverse transcriptase (RT) gag-pol p66 RT
Type:
Protein
Mol. Mass.:
162074.74
Organism:
Human immunodeficiency virus type 1 group M subtype B (isolate HXB2)
Description:
P04585
Residue:
1435
  
Inhibitor
Name:
BDBM192680
Synonyms:
3-(6-methoxy-3,4-dihydroquinolin-1(2H)-yl)-1-(4-(4-nitrophenyl)piperazin-1-yl)propan-1-one (6l)
Type:
Small organic molecule
Emp. Form.:
C23H28N4O4
Mol. Mass.:
424.4928
SMILES:
COc1ccc2N(CCC(=O)N3CCN(CC3)c3ccc(cc3)[N+]([O-])=O)CCCc2c1
: