Target
Serine/threonine-protein kinase SIK2
Ligand
BDBM192718
Substrate
Meas. Tech.
Caliper-based Mobility Shift Assay
pH
8±n/a
IC50
>7000±0 nM
Comments
extracted
Citation
 Sundberg, TBLiang, YWu, HChoi, HGKim, NDSim, TJohannessen, LPetrone, AKhor, BGraham, DBLatorre, IJPhillips, AJSchreiber, SLPerez, JShamji, AFGray, NSXavier, RJ Development of Chemical Probes for Investigation of Salt-Inducible Kinase Function in Vivo. ACS Chem Biol 11:2105-11 (2016)  
Target
Name:
Serine/threonine-protein kinase SIK2
Synonyms:
KIAA0781 SIK2 SNF1LK2 Serine/threonine-protein kinase SIK2
Type:
Protein
Mol. Mass.:
103906.53
Organism:
Homo sapiens (Human)
Description:
Residue:
926
  
Inhibitor
Name:
BDBM192718
Synonyms:
HG-9-91-01 derivative, 7
Type:
Small organic molecule
Emp. Form.:
C35H41N7O3
Mol. Mass.:
607.7451
SMILES:
COc1ccc(nc1)N1C(=O)N(Cc2cnc(Nc3ccc(cc3OC(C)C)C3CCN(C)CC3)nc12)c1c(C)cccc1C
: