Target
Serine/threonine-protein kinase/endoribonuclease IRE1 [547-977]
Ligand
BDBM192719
Substrate
Meas. Tech.
In vitro RNase Assay
IC50
1.8e+3± 1e+2 nM
Citation
 Feldman, HCTong, MWang, LMeza-Acevedo, RGobillot, TALebedev, IGliedt, MJHari, SBMitra, AKBackes, BJPapa, FRSeeliger, MAMaly, DJ Structural and Functional Analysis of the Allosteric Inhibition of IRE1a with ATP-Competitive Ligands. ACS Chem Biol 11:2195-205 (2016)  
Target
Name:
Serine/threonine-protein kinase/endoribonuclease IRE1 [547-977]
Synonyms:
ERN1 IRE1 | IRE1α
Type:
Protein
Mol. Mass.:
49232.75
Organism:
Homo sapiens (Human)
Description:
Cytosolic kinase and RNase domains of human IRE1α (residues 547-977) in SF9 insect cells
Residue:
431
  
Inhibitor
Name:
BDBM192719
Synonyms:
KIRA analog, 1
Type:
Small organic molecule
Emp. Form.:
C27H23F3N6O
Mol. Mass.:
504.5063
SMILES:
CC(C)c1nc(-c2ccc(NC(=O)Nc3cccc(c3)C(F)(F)F)c3ccccc23)c2c(N)nccn12
: