Target
Serine/threonine-protein kinase/endoribonuclease IRE1 [547-977]
Ligand
BDBM192722
Substrate
Meas. Tech.
Kinase Assay
pH
7.5±n/a
IC50
5.1e+2± 4e+1 nM
Comments
extracted
Citation
 Feldman, HCTong, MWang, LMeza-Acevedo, RGobillot, TALebedev, IGliedt, MJHari, SBMitra, AKBackes, BJPapa, FRSeeliger, MAMaly, DJ Structural and Functional Analysis of the Allosteric Inhibition of IRE1a with ATP-Competitive Ligands. ACS Chem Biol 11:2195-205 (2016)  
Target
Name:
Serine/threonine-protein kinase/endoribonuclease IRE1 [547-977]
Synonyms:
ERN1 IRE1 | IRE1α
Type:
Protein
Mol. Mass.:
49232.75
Organism:
Homo sapiens (Human)
Description:
Cytosolic kinase and RNase domains of human IRE1α (residues 547-977) in SF9 insect cells
Residue:
431
  
Inhibitor
Name:
BDBM192722
Synonyms:
KIRA analog, 4
Type:
Small organic molecule
Emp. Form.:
C28H23F3N6O
Mol. Mass.:
516.517
SMILES:
Nc1nccn2c(nc(-c3ccc(NC(=O)Nc4cccc(c4)C(F)(F)F)c4ccccc34)c12)C1CCC1
: