Target
Serine/threonine-protein kinase/endoribonuclease IRE1 [547-977]
Ligand
BDBM192725
Substrate
Meas. Tech.
Kinase Assay
pH
7.5±n/a
IC50
8.5e+2± 5e+1 nM
Comments
extracted
Citation
 Feldman, HCTong, MWang, LMeza-Acevedo, RGobillot, TALebedev, IGliedt, MJHari, SBMitra, AKBackes, BJPapa, FRSeeliger, MAMaly, DJ Structural and Functional Analysis of the Allosteric Inhibition of IRE1a with ATP-Competitive Ligands. ACS Chem Biol 11:2195-205 (2016)  
Target
Name:
Serine/threonine-protein kinase/endoribonuclease IRE1 [547-977]
Synonyms:
ERN1 IRE1 | IRE1α
Type:
Protein
Mol. Mass.:
49232.75
Organism:
Homo sapiens (Human)
Description:
Cytosolic kinase and RNase domains of human IRE1α (residues 547-977) in SF9 insect cells
Residue:
431
  
Inhibitor
Name:
BDBM192725
Synonyms:
KIRA analog, 7
Type:
Small organic molecule
Emp. Form.:
C24H20F4N6O
Mol. Mass.:
484.4488
SMILES:
CC1(CC1)c1nc(-c2ccc(NC(=O)Nc3cccc(c3)C(F)(F)F)cc2F)c2c(N)nccn12
: