Target
Serine/threonine-protein kinase/endoribonuclease IRE1 [547-977]
Ligand
BDBM192735
Substrate
Meas. Tech.
Kinase Assay
pH
7.5±n/a
IC50
6.6e+2± 8e+1 nM
Comments
extracted
Citation
 Feldman, HCTong, MWang, LMeza-Acevedo, RGobillot, TALebedev, IGliedt, MJHari, SBMitra, AKBackes, BJPapa, FRSeeliger, MAMaly, DJ Structural and Functional Analysis of the Allosteric Inhibition of IRE1a with ATP-Competitive Ligands. ACS Chem Biol 11:2195-205 (2016)  
Target
Name:
Serine/threonine-protein kinase/endoribonuclease IRE1 [547-977]
Synonyms:
ERN1 IRE1 | IRE1α
Type:
Protein
Mol. Mass.:
49232.75
Organism:
Homo sapiens (Human)
Description:
Cytosolic kinase and RNase domains of human IRE1α (residues 547-977) in SF9 insect cells
Residue:
431
  
Inhibitor
Name:
BDBM192735
Synonyms:
KIRA analog, 17
Type:
Small organic molecule
Emp. Form.:
C29H25F3N6O2
Mol. Mass.:
546.543
SMILES:
COc1cc(NC(=O)Nc2ccc(-c3nc(n4ccnc(N)c34)C3(C)CC3)c3ccccc23)cc(c1)C(F)(F)F
: