Target
Serine/threonine-protein kinase/endoribonuclease IRE1 [547-977]
Ligand
BDBM192737
Substrate
Meas. Tech.
In vitro RNase Assay
IC50
1.6e+3± 1e+2 nM
Citation
 Feldman, HCTong, MWang, LMeza-Acevedo, RGobillot, TALebedev, IGliedt, MJHari, SBMitra, AKBackes, BJPapa, FRSeeliger, MAMaly, DJ Structural and Functional Analysis of the Allosteric Inhibition of IRE1a with ATP-Competitive Ligands. ACS Chem Biol 11:2195-205 (2016)  
Target
Name:
Serine/threonine-protein kinase/endoribonuclease IRE1 [547-977]
Synonyms:
ERN1 IRE1 | IRE1α
Type:
Protein
Mol. Mass.:
49232.75
Organism:
Homo sapiens (Human)
Description:
Cytosolic kinase and RNase domains of human IRE1α (residues 547-977) in SF9 insect cells
Residue:
431
  
Inhibitor
Name:
BDBM192737
Synonyms:
KIRA analog, 19
Type:
Small organic molecule
Emp. Form.:
C28H27N7O3S
Mol. Mass.:
541.624
SMILES:
CNS(=O)(=O)c1cccc(NC(=O)Nc2ccc(-c3nc(n4ccnc(N)c34)C3(C)CC3)c3ccccc23)c1
: