Target
Seed linoleate 13S-lipoxygenase-1
Ligand
BDBM192762
Substrate
Meas. Tech.
Lipo-oxygenase Inhibitory Assay
pH
7±n/a
Temperature
298.15±n/a K
IC50
3.05e+4± 1.9e+3 nM
Comments
extracted
Citation
 Jabbari, ASadeghian, HSalimi, AMousavian, MSeyedi, SMBakavoli, M 2-Prenylated m-dimethoxybenzenes as potent inhibitors of 15-lipo-oxygenase: inhibitory mechanism and SAR studies. Chem Biol Drug Des 88:460-9 (2016)  
Target
Name:
Seed linoleate 13S-lipoxygenase-1
Synonyms:
15-LOX 15-lipo-oxygenase (SLO) L-1 LOX1.1 Lipoxygenase (LOX) Lipoxygenase-1 | Seed lipoxygenase-1
Type:
Enzyme
Mol. Mass.:
94365.66
Organism:
Glycine max (soybean)
Description:
Residue:
839
  
Inhibitor
Name:
BDBM192762
Synonyms:
2-Allyl-1,3-dimethoxy-5-methylbenzene (8)
Type:
Small organic molecule
Emp. Form.:
C12H16O2
Mol. Mass.:
192.2542
SMILES:
COc1cc(C)cc(OC)c1CC=C
: