Target
Sortilin
Ligand
BDBM50445054
Substrate
Meas. Tech.
mSortilin Affinity Assay
pH
7.4±n/a
Ki
210±n/a nM
IC50
220±n/a nM
Comments
extracted
Citation
 Maltas, PJWatson, SLangg{hacek over (a)}rd, MDavid, L N-substituted-5-substituted phthalamic acids as sortilin inhibitors US Patent  US9682967 Publication Date 6/20/2017 
Target
Name:
Sortilin
Synonyms:
NTR3 SORT_MOUSE mNTR3
Type:
Protein
Mol. Mass.:
91189.40
Organism:
Mouse
Description:
Q6PHU5
Residue:
825
  
Inhibitor
Name:
BDBM50445054
Synonyms:
CHEMBL3098745 US9682967, 1
Type:
Small organic molecule
Emp. Form.:
C15H11F3N2O3
Mol. Mass.:
324.2546
SMILES:
Cc1cccc(NC(=O)c2ccc(cc2C(O)=O)C(F)(F)F)n1
: