Target
Sortilin
Ligand
BDBM159162
Substrate
Meas. Tech.
hSortilin Affinity Assay
pH
7.4±n/a
Ki
5238±n/a nM
IC50
5500±n/a nM
Comments
extracted
Citation
 Maltas, PJWatson, SLangg{hacek over (a)}rd, MDavid, L N-substituted-5-substituted phthalamic acids as sortilin inhibitors US Patent  US9682967 Publication Date 6/20/2017 
Target
Name:
Sortilin
Synonyms:
Neurotensin receptor 3 SORT_HUMAN
Type:
PROTEIN
Mol. Mass.:
92054.53
Organism:
Homo sapiens (Human)
Description:
ChEMBL_1282402
Residue:
831
  
Inhibitor
Name:
BDBM159162
Synonyms:
US10195186, Example 26 | US9682967, 26
Type:
Small organic molecule
Emp. Form.:
C13H9BrN2O3
Mol. Mass.:
321.126
SMILES:
OC(=O)c1cc(Br)ccc1C(=O)Nc1cccnc1
: