Target
Tyrosine-protein kinase JAK3 [781-1124]
Ligand
BDBM192786
Substrate
Meas. Tech.
Phosphorylation Assay
pH
7.5±n/a
Temperature
25±n/a K
IC50
1270±n/a nM
Citation
 Goldstein, DMBrameld, KAVerner, E Azaindole derivatives as tyrosine kinase inhibitors US Patent  US9187487 Publication Date 11/17/2015 
Target
Name:
Tyrosine-protein kinase JAK3 [781-1124]
Synonyms:
JAK3 JAK3_HUMAN Tyrosine-protein kinase JAK3 Tyrosine-protein kinase JAK3 (aa 781-1124)
Type:
Mol. Mass.:
38772.27
Organism:
Homo sapiens (Human)
Description:
P52333[781-1124]
Residue:
344
  
Inhibitor
Name:
BDBM192786
Synonyms:
US9187487, 16
Type:
Small organic molecule
Emp. Form.:
C26H28N6O2
Mol. Mass.:
456.5395
SMILES:
CC(C)(C)C(=O)c1c[nH]c2ncc(Nc3ccc(\C=C(\[N+]#[C-])C(=O)N4CCCCC4)cc3)nc12
: