Target
Tyrosine-protein kinase JAK3 [781-1124]
Ligand
BDBM192799
Substrate
Meas. Tech.
Phosphorylation Assay
pH
7.5±n/a
Temperature
25±n/a K
IC50
0.2±n/a nM
Citation
 Goldstein, DMBrameld, KAVerner, E Azaindole derivatives as tyrosine kinase inhibitors US Patent  US9187487 Publication Date 11/17/2015 
Target
Name:
Tyrosine-protein kinase JAK3 [781-1124]
Synonyms:
JAK3 JAK3_HUMAN Tyrosine-protein kinase JAK3 Tyrosine-protein kinase JAK3 (aa 781-1124)
Type:
Mol. Mass.:
38772.27
Organism:
Homo sapiens (Human)
Description:
P52333[781-1124]
Residue:
344
  
Inhibitor
Name:
BDBM192799
Synonyms:
US9187487, 50
Type:
Small organic molecule
Emp. Form.:
C22H23N7O2
Mol. Mass.:
417.4637
SMILES:
CC(C)NC(=O)c1c[nH]c2ncc(Nc3ccc(C=C(C#N)C(=O)N(C)C)cc3)nc12
: