Target
Presenilin-1
Ligand
BDBM193070
Substrate
Meas. Tech.
Cell-Based Assay
Temperature
310.15±n/a K
IC50
14.5±n/a nM
Comments
extracted
Citation
 Pettersson, MYJohnson, DSSubramanyam, CO'Donnell, CJam Ende, CWGreen, MEPatel, NCStiff, CMTran, TPKauffman, GWStepan, AFVerhoest, PR Substituted pyrido[1,2-a]pyrazines for the treatment of neurodegenerative and neurological disorders US Patent  US9193726 Publication Date 11/24/2015 
Target
Name:
Presenilin-1
Synonyms:
3.4.23.- Gamma-Secretase Subunit Presenilin-1 PS1 PSEN1 PSNL1 Presenilin-1 CTF12 Protein S182
Type:
Mol. Mass.:
52657.13
Organism:
Homo sapiens (Human)
Description:
P49768
Residue:
467
  
Inhibitor
Name:
BDBM193070
Synonyms:
US9193726, 58
Type:
Small organic molecule
Emp. Form.:
C25H24ClF3N4O4
Mol. Mass.:
536.931
SMILES:
C[C@@H]([C@@H]1CC[C@@H](O1)c1ccc(Cl)cc1OC(F)(F)F)N1CCn2c(ccc(-n3cnc(C)c3)c2=O)C1=O
: