Target
Presenilin-1
Ligand
BDBM193074
Substrate
Meas. Tech.
Cell-Based Assay
Temperature
310.15±n/a K
IC50
13.3±n/a nM
Comments
extracted
Citation
 Pettersson, MYJohnson, DSSubramanyam, CO'Donnell, CJam Ende, CWGreen, MEPatel, NCStiff, CMTran, TPKauffman, GWStepan, AFVerhoest, PR Substituted pyrido[1,2-a]pyrazines for the treatment of neurodegenerative and neurological disorders US Patent  US9193726 Publication Date 11/24/2015 
Target
Name:
Presenilin-1
Synonyms:
3.4.23.- Gamma-Secretase Subunit Presenilin-1 PS1 PSEN1 PSNL1 Presenilin-1 CTF12 Protein S182
Type:
Mol. Mass.:
52657.13
Organism:
Homo sapiens (Human)
Description:
P49768
Residue:
467
  
Inhibitor
Name:
BDBM193074
Synonyms:
US9193726, 62
Type:
Small organic molecule
Emp. Form.:
C23H21ClF2N4O3
Mol. Mass.:
474.888
SMILES:
Cc1cn(cn1)-c1ccc2C(=O)N(C[C@@H]3CC[C@@H](O3)c3cc(F)c(Cl)c(F)c3)CCn2c1=O
: