Target
Presenilin-1
Ligand
BDBM193085
Substrate
Meas. Tech.
Cell-Based Assay
Temperature
310.15±n/a K
IC50
19.8±n/a nM
Comments
extracted
Citation
 Pettersson, MYJohnson, DSSubramanyam, CO'Donnell, CJam Ende, CWGreen, MEPatel, NCStiff, CMTran, TPKauffman, GWStepan, AFVerhoest, PR Substituted pyrido[1,2-a]pyrazines for the treatment of neurodegenerative and neurological disorders US Patent  US9193726 Publication Date 11/24/2015 
Target
Name:
Presenilin-1
Synonyms:
3.4.23.- Gamma-Secretase Subunit Presenilin-1 PS1 PSEN1 PSNL1 Presenilin-1 CTF12 Protein S182
Type:
Mol. Mass.:
52657.13
Organism:
Homo sapiens (Human)
Description:
P49768
Residue:
467
  
Inhibitor
Name:
BDBM193085
Synonyms:
US9193726, 73
Type:
Small organic molecule
Emp. Form.:
C25H25F3N4O3
Mol. Mass.:
486.4862
SMILES:
C[C@H]1Cn2c(ccc(-n3cnc(C)c3)c2=O)C(=O)N1C[C@H]1CC[C@H](O1)c1ccc(cc1)C(F)(F)F
: