Target
Lysosomal Pro-X carboxypeptidase
Ligand
BDBM193261
Substrate
Meas. Tech.
Enzyme Assay
Ki
424600±n/a nM
Citation
 Shariat-Madar, ZRimoldi, JMGadepalli, RS Selective inhibitors of prolylcarboxypeptidase US Patent  US9193762 Publication Date 11/24/2015 
Target
Name:
Lysosomal Pro-X carboxypeptidase
Synonyms:
Angiotensinase C PCP PRCP Prolylcarboxypeptidase | Prolylcarboxypeptidase (PRCP)
Type:
Enzyme
Mol. Mass.:
55805.19
Organism:
Homo sapiens (Human)
Description:
P42785
Residue:
496
  
Inhibitor
Name:
BDBM193261
Synonyms:
US9193762, RS-33-4
Type:
Small organic molecule
Emp. Form.:
C27H33N3O5
Mol. Mass.:
479.568
SMILES:
COc1ccccc1CCNC(=O)[C@@H]1CCCN1C(=O)[C@@H]1CCCN1C(=O)OCc1ccccc1
: