Target
Lysosomal Pro-X carboxypeptidase
Ligand
BDBM193263
Substrate
Meas. Tech.
Enzyme Assay
Ki
61500±n/a nM
Citation
 Shariat-Madar, ZRimoldi, JMGadepalli, RS Selective inhibitors of prolylcarboxypeptidase US Patent  US9193762 Publication Date 11/24/2015 
Target
Name:
Lysosomal Pro-X carboxypeptidase
Synonyms:
Angiotensinase C PCP PRCP Prolylcarboxypeptidase | Prolylcarboxypeptidase (PRCP)
Type:
Enzyme
Mol. Mass.:
55805.19
Organism:
Homo sapiens (Human)
Description:
P42785
Residue:
496
  
Inhibitor
Name:
BDBM193263
Synonyms:
US9193762, RS-33-7
Type:
Small organic molecule
Emp. Form.:
C33H53N3O4
Mol. Mass.:
555.7916
SMILES:
CCCCCCCCCCCCCCCNC(=O)[C@@H]1CCCN1C(=O)[C@@H]1CCCN1C(=O)OCc1ccccc1
: