Target
Lysosomal Pro-X carboxypeptidase
Ligand
BDBM193280
Substrate
Meas. Tech.
Activation Assay
Ki
5.04e+4±n/a nM
Citation
 Shariat-Madar, ZRimoldi, JMGadepalli, RS Selective inhibitors of prolylcarboxypeptidase US Patent  US9193762 Publication Date 11/24/2015 
Target
Name:
Lysosomal Pro-X carboxypeptidase
Synonyms:
Angiotensinase C PCP PRCP Prolylcarboxypeptidase | Prolylcarboxypeptidase (PRCP)
Type:
Enzyme
Mol. Mass.:
55805.19
Organism:
Homo sapiens (Human)
Description:
P42785
Residue:
496
  
Inhibitor
Name:
BDBM193280
Synonyms:
US9193762, RS-48-03
Type:
Small organic molecule
Emp. Form.:
C21H39N3O2
Mol. Mass.:
365.5533
SMILES:
CCCCCCCCCCCCNC(=O)C1CCN1C(=O)C1CCCN1
: