Target
Lysosomal Pro-X carboxypeptidase
Ligand
BDBM193282
Substrate
Meas. Tech.
Enzyme Assay
Ki
3.323e+5±n/a nM
Citation
 Shariat-Madar, ZRimoldi, JMGadepalli, RS Selective inhibitors of prolylcarboxypeptidase US Patent  US9193762 Publication Date 11/24/2015 
Target
Name:
Lysosomal Pro-X carboxypeptidase
Synonyms:
Angiotensinase C PCP PRCP Prolylcarboxypeptidase | Prolylcarboxypeptidase (PRCP)
Type:
Enzyme
Mol. Mass.:
55805.19
Organism:
Homo sapiens (Human)
Description:
P42785
Residue:
496
  
Inhibitor
Name:
BDBM193282
Synonyms:
US9193762, RS-37-01
Type:
Small organic molecule
Emp. Form.:
C24H28ClN3O4
Mol. Mass.:
457.95
SMILES:
Clc1ccccc1CNC(=O)CCCNC(=O)[C@@H]1CCCN1C(=O)OCc1ccccc1
: