Target
Serine protease 1
Ligand
BDBM193320
Substrate
Meas. Tech.
Inhibition Assay
pH
8±n/a
Temperature
298.15±n/a K
IC50
0.31±n/a nM
Comments
extracted
Citation
 Fujiyasu, JOhne, KYamaki, SImaizumi, THondo, TMatsuura, KSatou, TSasamura, S Guanidinobenzoic acid compound US Patent  US9199927 Publication Date 12/1/2015 
Target
Name:
Serine protease 1
Synonyms:
Alpha-trypsin chain 1 Beta-trypsin PRSS1 TRP1 TRY1_HUMAN Thrombin & trypsin Trypsin I | Trypsin-1
Type:
Enzyme
Mol. Mass.:
26557.80
Organism:
Homo sapiens (Human)
Description:
P07477
Residue:
247
  
Inhibitor
Name:
BDBM193320
Synonyms:
US9199927, 31
Type:
Small organic molecule
Emp. Form.:
C26H22ClF3N4O5
Mol. Mass.:
562.925
SMILES:
NC(=N)Nc1ccc(cc1)C(=O)Oc1ccc(CC(=O)N[C@@H](Cc2ccc(cc2)C(F)(F)F)C(O)=O)c(Cl)c1
: