Target
Serine protease 1
Ligand
BDBM193349
Substrate
Meas. Tech.
Inhibition Assay
pH
8±n/a
Temperature
298.15±n/a K
IC50
0.19±n/a nM
Comments
extracted
Citation
 Fujiyasu, JOhne, KYamaki, SImaizumi, THondo, TMatsuura, KSatou, TSasamura, S Guanidinobenzoic acid compound US Patent  US9199927 Publication Date 12/1/2015 
Target
Name:
Serine protease 1
Synonyms:
Alpha-trypsin chain 1 Beta-trypsin PRSS1 TRP1 TRY1_HUMAN Thrombin & trypsin Trypsin I | Trypsin-1
Type:
Enzyme
Mol. Mass.:
26557.80
Organism:
Homo sapiens (Human)
Description:
P07477
Residue:
247
  
Inhibitor
Name:
BDBM193349
Synonyms:
US9199927, 108 | US9199927, 60
Type:
Small organic molecule
Emp. Form.:
C27H25ClN4O7
Mol. Mass.:
552.963
SMILES:
CC(C(=O)N(CC(O)=O)Cc1cccc(c1)C(O)=O)c1ccc(OC(=O)c2ccc(NC(N)=N)cc2)cc1Cl
: