Target
Trypsinogen 16
Ligand
BDBM193395
Substrate
Meas. Tech.
Inhibition Assay
pH
8±n/a
Temperature
298.15±n/a K
IC50
0.28±n/a nM
Comments
extracted
Citation
 Fujiyasu, JOhne, KYamaki, SImaizumi, THondo, TMatsuura, KSatou, TSasamura, S Guanidinobenzoic acid compound US Patent  US9199927 Publication Date 12/1/2015 
Target
Name:
Trypsinogen 16
Synonyms:
Trypsin
Type:
Protein
Mol. Mass.:
26127.36
Organism:
Mus musculus (Mouse)
Description:
Q9Z1R9
Residue:
246
  
Inhibitor
Name:
BDBM193395
Synonyms:
US9199927, 113
Type:
Small organic molecule
Emp. Form.:
C29H25N5O7
Mol. Mass.:
555.5381
SMILES:
NC(=N)Nc1ccc(cc1)C(=O)Oc1ccc2nc(ccc2c1)C(=O)N(CC(O)=O)Cc1ccc(CC(O)=O)cc1
: