Target
Cyclin-dependent kinase 2/G1/S-specific cyclin-E1
Ligand
BDBM5622
Substrate
GST-Rb fusion protein
Meas. Tech.
Kinase Inhibition assay
IC50
480±n/a nM
Citation
 Yue, EWHigley, CADiMeo, SVCarini, DJNugiel, DABenware, CBenfield, PABurton, CRCox, SGrafstrom, RHSharp, DMSisk, LMBoylan, JFMuckelbauer, JKSmallwood, AMChen, HChang, CHSeitz, SPTrainor, GL Synthesis and evaluation of indenopyrazoles as cyclin-dependent kinase inhibitors. 3. Structure activity relationships at C3(1,2). J Med Chem 45:5233-48 (2002)  
Target
Name:
Cyclin-dependent kinase 2/G1/S-specific cyclin-E1
Synonyms:
CDK2/CycE CDK2/E Cyclin-Dependent Kinase 2 (CDK2) Cyclin-dependent kinase 2/cyclin E1
Type:
Protein
Mol. Mass.:
Description:
Components:
This complex has 2 components.
Component 1
Name:
Cyclin-dependent kinase 2
Synonyms:
CDK2 CDK2_HUMAN Cell division protein kinase 2 Protein cereblon/Cyclin-dependent kinase 2 | p33 protein kinase
Type:
Enzyme Subunit
Mol. Mass.:
33938.17
Organism:
Homo sapiens (Human)
Description:
P24941
Residue:
298
  
Component 2
Name:
G1/S-specific cyclin-E1
Synonyms:
CCNE CCNE1_HUMAN
Type:
Enzyme Subunit
Mol. Mass.:
47073.17
Organism:
Homo sapiens (Human)
Description:
Residue:
410
  
Inhibitor
Name:
BDBM5622
Synonyms:
3-Cyclopropyl-5-(acetamido)indeno[1,2-c]pyrazol-4-one N-{3-cyclopropyl-4-oxo-2H,4H-indeno[1,2-c]pyrazol-5-yl}acetamide
Type:
Small organic molecule
Emp. Form.:
C15H13N3O2
Mol. Mass.:
267.2826
SMILES:
CC(=O)Nc1cccc2-c3n[nH]c(C4CC4)c3C(=O)c12
:
Substrate
Name:
GST-Rb fusion protein
Synonyms:
Glutathione S-transferase (GST)-retinoblastoma (Rb) fusion RB1 Rb | retinoblastoma
Type:
Other Protein Type
Mol. Mass.:
106410.17
Organism:
Homo sapiens (Human)
Description:
GST-60 kDa Rb fusion protein (comprising amino acids 378 to 928 of retinoblastoma)
Residue:
928