Target
Cyclin-dependent kinase 4/G1/S-specific cyclin-D1
Ligand
BDBM5647
Substrate
GST-Rb fusion protein
Meas. Tech.
Kinase Inhibition assay
IC50
53±n/a nM
Citation
 Yue, EWHigley, CADiMeo, SVCarini, DJNugiel, DABenware, CBenfield, PABurton, CRCox, SGrafstrom, RHSharp, DMSisk, LMBoylan, JFMuckelbauer, JKSmallwood, AMChen, HChang, CHSeitz, SPTrainor, GL Synthesis and evaluation of indenopyrazoles as cyclin-dependent kinase inhibitors. 3. Structure activity relationships at C3(1,2). J Med Chem 45:5233-48 (2002)  
Target
Name:
Cyclin-dependent kinase 4/G1/S-specific cyclin-D1
Synonyms:
CDK4/CycD CDK4/Cyclin D1 Cyclin-Dependent Kinase 4 (CDK4) Cyclin-dependent kinase 4/G1/S-specific cyclin D1 | Cyclin-dependent kinase 4/cyclin D1
Type:
Protein Complex
Mol. Mass.:
Description:
CDK4/D1 complexes were purified from insect cells co-infected with baculovirus vectors containing each of the components.
Components:
This complex has 2 components.
Component 1
Name:
Cyclin-dependent kinase 4
Synonyms:
CDK4 Cell division protein kinase 4 PSK-J3
Type:
Enzyme Subunit
Mol. Mass.:
33731.96
Organism:
Homo sapiens (Human)
Description:
P11802
Residue:
303
  
Component 2
Name:
G1/S-specific cyclin-D1
Synonyms:
B-cell lymphoma 1 protein BCL-1 oncogene CCND1 PRAD1 | PRAD1 oncogene
Type:
Enzyme Subunit
Mol. Mass.:
33717.70
Organism:
Homo sapiens (Human)
Description:
Residue:
295
  
Inhibitor
Name:
BDBM5647
Synonyms:
3-(5-Methylthien-2-yl)-5-(carbamoylamino)indeno[1,2-c]pyrazol-4-one [3-(5-methylthiophen-2-yl)-4-oxo-2H,4H-indeno[1,2-c]pyrazol-5-yl]urea
Type:
Small organic molecule
Emp. Form.:
C16H12N4O2S
Mol. Mass.:
324.357
SMILES:
Cc1ccc(s1)-c1[nH]nc2-c3cccc(NC(N)=O)c3C(=O)c12
:
Substrate
Name:
GST-Rb fusion protein
Synonyms:
Glutathione S-transferase (GST)-retinoblastoma (Rb) fusion RB1 Rb | retinoblastoma
Type:
Other Protein Type
Mol. Mass.:
106410.17
Organism:
Homo sapiens (Human)
Description:
GST-60 kDa Rb fusion protein (comprising amino acids 378 to 928 of retinoblastoma)
Residue:
928