Target
Lysosomal protective protein [29-480]
Ligand
BDBM193533
Substrate
Meas. Tech.
Inhibition Assay
pH
5.5±n/a
Temperature
298.15±n/a K
IC50
1670±n/a nM
Comments
extracted
Citation
 Ruf, SSadowski, TWirth, KSchreuder, HBuning, CKallus, CStrobel, HWehlan, H Biaryl-propionic acid derivatives and their use as pharmaceuticals US Patent  US9199947 Publication Date 12/1/2015 
Target
Name:
Lysosomal protective protein [29-480]
Synonyms:
CTSA Cathepsin A (CTSA) PPGB_HUMAN
Type:
Mol. Mass.:
51408.15
Organism:
Homo sapiens (Human)
Description:
P10619[29-480]
Residue:
452
  
Inhibitor
Name:
BDBM193533
Synonyms:
US9199947, 26
Type:
Small organic molecule
Emp. Form.:
C21H21NO3S
Mol. Mass.:
367.461
SMILES:
CCCOc1cccc(c1)-c1cccc(c1)C(CC(O)=O)c1nccs1
: