Target
cAMP and cAMP-inhibited cGMP 3',5'-cyclic phosphodiesterase 10A
Ligand
BDBM194436
Substrate
Meas. Tech.
Diaxonhit Phosphodiesterase Assay
pH
7.4±n/a
Temperature
310.15±n/a K
IC50
2.3±n/a nM
Comments
extracted
Citation
 Leblond, BTaverne, TChauvignac, CBeausoleil, ECasagrande, ADesire, LPando, MPDonello, JEYang, R Substituted 6, 7-dialkoxy-3-isoquinoline derivatives as inhibitors of phosphodiesterase 10 (PDE 10A) US Patent  US9200016 Publication Date 12/1/2015 
Target
Name:
cAMP and cAMP-inhibited cGMP 3',5'-cyclic phosphodiesterase 10A
Synonyms:
3',5'-cyclic phosphodiesterase PDE10_HUMAN Phosphodiesterase 10A
Type:
Protein
Mol. Mass.:
88412.52
Organism:
Homo sapiens (Human)
Description:
Q9Y233
Residue:
779
  
Inhibitor
Name:
BDBM194436
Synonyms:
US9200016, 118 | US9902710, Compound 118
Type:
Small organic molecule
Emp. Form.:
C27H27N2O5
Mol. Mass.:
459.5142
SMILES:
CCCc1ncc(Cc2ccc3cccc(OCCC([O-])=O)c3n2)c2cc(OC)c(OC)cc12
: