Target
cAMP and cAMP-inhibited cGMP 3',5'-cyclic phosphodiesterase 10A
Ligand
BDBM194477
Substrate
Meas. Tech.
Diaxonhit Phosphodiesterase Assay
pH
7.4±n/a
Temperature
310.15±n/a K
IC50
0.42±n/a nM
Comments
extracted
Citation
 Leblond, BTaverne, TChauvignac, CBeausoleil, ECasagrande, ADesire, LPando, MPDonello, JEYang, R Substituted 6, 7-dialkoxy-3-isoquinoline derivatives as inhibitors of phosphodiesterase 10 (PDE 10A) US Patent  US9200016 Publication Date 12/1/2015 
Target
Name:
cAMP and cAMP-inhibited cGMP 3',5'-cyclic phosphodiesterase 10A
Synonyms:
3',5'-cyclic phosphodiesterase PDE10_HUMAN Phosphodiesterase 10A
Type:
Protein
Mol. Mass.:
88412.52
Organism:
Homo sapiens (Human)
Description:
Q9Y233
Residue:
779
  
Inhibitor
Name:
BDBM194477
Synonyms:
US9200016, 159 | US9902710, Compound 159
Type:
Small organic molecule
Emp. Form.:
C21H20N4O4S
Mol. Mass.:
424.473
SMILES:
COc1cc2cncc(Cc3ccc4cccc(NS(N)(=O)=O)c4n3)c2cc1OC
: