Target
Monoglyceride lipase
Ligand
BDBM37997
Substrate
Meas. Tech.
In Vitro Competitive Activity-Based Protein Profiling (Human)
Temperature
298.15±n/a K
IC50
5500±n/a nM
Comments
extracted
Citation
 Grice, CABuzard, DJShaghafi, MB MAGL inhibitors US Patent  US10093635 Publication Date 10/9/2018 
Target
Name:
Monoglyceride lipase
Synonyms:
HU-K5 Lysophospholipase-like MGL MGLL_HUMAN
Type:
Hydrolase
Mol. Mass.:
33264.56
Organism:
Homo sapiens (Human)
Description:
Human recombinant MGL (Cayman Chemical, cat# 10008354).
Residue:
303
  
Inhibitor
Name:
BDBM37997
Synonyms:
1-((3-fluoro-6-((4-(((1,1,1,3,3,3- hexafluoropropan-2- yl)oxy)carbonyl)piperazin-1-yl)methyl)-2- methylphenoxy)methyl)cyclopropane-1- carboxylic acid | US10093635, Example 38
Type:
Small organic molecule
Emp. Form.:
C21H23F7N2O5
Mol. Mass.:
516.4065
SMILES:
Cc1c(F)ccc(CN2CCN(CC2)C(=O)OC(C(F)(F)F)C(F)(F)F)c1OCC1(CC1)C(O)=O
: