Target
Monoglyceride lipase
Ligand
BDBM38004
Substrate
Meas. Tech.
In Vitro Competitive Activity-Based Protein Profiling (Human)
Temperature
298.15±n/a K
IC50
5500±n/a nM
Comments
extracted
Citation
 Grice, CABuzard, DJShaghafi, MB MAGL inhibitors US Patent  US10093635 Publication Date 10/9/2018 
Target
Name:
Monoglyceride lipase
Synonyms:
HU-K5 Lysophospholipase-like MGL MGLL_HUMAN
Type:
Hydrolase
Mol. Mass.:
33264.56
Organism:
Homo sapiens (Human)
Description:
Human recombinant MGL (Cayman Chemical, cat# 10008354).
Residue:
303
  
Inhibitor
Name:
BDBM38004
Synonyms:
(1s,3s)-3-(2-((4-(((1,1,1,3,3,3- hexafluoropropan-2- yl)oxy)carbonyl)piperazin-1-yl)methyl)-5- (trifluoromethyl)phenoxy)cyclobutane-1- carboxylic acid | US10093635, Example 44
Type:
Small organic molecule
Emp. Form.:
C21H21F9N2O5
Mol. Mass.:
552.3875
SMILES:
OC(=O)[C@@H]1C[C@@H](C1)Oc1cc(ccc1CN1CCN(CC1)C(=O)OC(C(F)(F)F)C(F)(F)F)C(F)(F)F
: