Target
Hypoxanthine-guanine-xanthine phosphoribosyltransferase
Ligand
BDBM194498
Substrate
Meas. Tech.
Spectrophotometric Assay
pH
7.4±n/a
Ki
700±100 nM
Comments
extracted
Citation
 De Jersey, JGuddat, LWHockova, DKeough, DT 6-oxopurine phosphoribosyltransferase inhibitors US Patent  US9200020 Publication Date 12/1/2015 
Target
Name:
Hypoxanthine-guanine-xanthine phosphoribosyltransferase
Synonyms:
HGXR_PLAFG Hypoxanthine-guanine-xanthine phosphoribosyltransferase (PfHGXPRT) | LACZ
Type:
Protein
Mol. Mass.:
26352.14
Organism:
Plasmodium falciparum
Description:
P20035
Residue:
231
  
Inhibitor
Name:
BDBM194498
Synonyms:
US9200020, Table 3 compound 7
Type:
Small organic molecule
Emp. Form.:
C11H18N6O6P
Mol. Mass.:
361.271
SMILES:
Nc1nc2n(CCN(CCP(O)(O)=O)CC(O)=O)c[nH]c2c(=O)[nH]1
: