Target
Hypoxanthine-guanine-xanthine phosphoribosyltransferase
Ligand
BDBM60894
Substrate
Meas. Tech.
Growth Inhibition Assay
Temperature
310.15±n/a K
Ki
>210000±n/a nM
Comments
extracted
Citation
 De Jersey, JGuddat, LWHockova, DKeough, DT 6-oxopurine phosphoribosyltransferase inhibitors US Patent  US9200020 Publication Date 12/1/2015 
Target
Name:
Hypoxanthine-guanine-xanthine phosphoribosyltransferase
Synonyms:
HGXR_PLAFG Hypoxanthine-guanine-xanthine phosphoribosyltransferase (PfHGXPRT) | LACZ
Type:
Protein
Mol. Mass.:
26352.14
Organism:
Plasmodium falciparum
Description:
P20035
Residue:
231
  
Inhibitor
Name:
BDBM60894
Synonyms:
US9200020, Table 3 compound 9B
Type:
Emp. Form.:
C13H21N5O6P
Mol. Mass.:
374.3095
SMILES:
OC(=O)CCCN(CCn1c[nH]c2c1nc[nH]c2=O)CCP(O)(O)=O
: