Target
ADAM metallopeptidase with thrombospondin type 1 motif 4
Ligand
BDBM194638
Substrate
Meas. Tech.
Shift AlphaScreen Assay
IC50
183±n/a nM
Citation
 Durham, TBMarimuthu, JWiley, MR Aggrecanase inhibitors US Patent  US9206139 Publication Date 12/8/2015 
Target
Name:
ADAM metallopeptidase with thrombospondin type 1 motif 4
Synonyms:
Metalloproteinase with thrombospondin motifs 4 (ADAMTS-4)
Type:
Enzyme
Mol. Mass.:
106624.01
Organism:
Canis lupus familiaris (Dog)
Description:
A0A8I3Q3A2
Residue:
992
  
Inhibitor
Name:
BDBM194638
Synonyms:
US9206139, 1
Type:
Small organic molecule
Emp. Form.:
C18H20F3N3O3
Mol. Mass.:
383.3649
SMILES:
C[C@H](Cc1ccc(cc1)C(F)(F)F)C(=O)NC[C@]1(NC(=O)NC1=O)C1CC1
: