Target
Stromelysin-1
Ligand
BDBM194646
Substrate
Meas. Tech.
In Vitro Fluorescence Assay
pH
7.5±n/a
IC50
13165±n/a nM
Comments
extracted
Citation
 Durham, TBMarimuthu, JWiley, MR Aggrecanase inhibitors US Patent  US9206139 Publication Date 12/8/2015 
Target
Name:
Stromelysin-1
Synonyms:
MMP-3 MMP3_HUMAN Matrix metalloproteinase 3 Matrix metalloproteinase-3 (MMP-3) SL-1 Stromelysin 1 | Transin-1
Type:
Enzyme
Mol. Mass.:
53973.13
Organism:
Homo sapiens (Human)
Description:
P08254
Residue:
477
  
Inhibitor
Name:
BDBM194646
Synonyms:
US9206139, 5
Type:
Small organic molecule
Emp. Form.:
C19H22F3N3O3
Mol. Mass.:
397.3915
SMILES:
CC(C)(Cc1ccc(cc1)C(F)(F)F)C(=O)NC[C@]1(NC(=O)NC1=O)C1CC1
: