Target
Collagenase 3
Ligand
BDBM194646
Substrate
Meas. Tech.
In Vitro Fluorescence Assay
pH
7.5±n/a
IC50
4808±n/a nM
Comments
extracted
Citation
 Durham, TBMarimuthu, JWiley, MR Aggrecanase inhibitors US Patent  US9206139 Publication Date 12/8/2015 
Target
Name:
Collagenase 3
Synonyms:
MMP-13 MMP13_HUMAN Matrix metalloproteinase-13 (MMP-13) | Matrix metalloproteinase-13 (MMP13)
Type:
Enzyme
Mol. Mass.:
53808.06
Organism:
Homo sapiens (Human)
Description:
P45452
Residue:
471
  
Inhibitor
Name:
BDBM194646
Synonyms:
US9206139, 5
Type:
Small organic molecule
Emp. Form.:
C19H22F3N3O3
Mol. Mass.:
397.3915
SMILES:
CC(C)(Cc1ccc(cc1)C(F)(F)F)C(=O)NC[C@]1(NC(=O)NC1=O)C1CC1
: