Target
Induced myeloid leukemia cell differentiation protein Mcl-1
Ligand
BDBM38115
Substrate
Meas. Tech.
Bak Peptide Binding Assay
pH
7.5±n/a
Temperature
298.15±n/a K
IC50
<100±n/a nM
Comments
extracted
Citation
 Chen, CHChen, ZFortanet, JGGrunenfelder, DKarki, RKato, MLaMarche, MJPerez, LBStams, TMWilliams, S 1-pyridazin-/triazin-3-yl-piper(-azine)/idine/pyrolidine derivatives and compositions thereof for inhibiting the activity of SHP2 US Patent  US10093646 Publication Date 10/9/2018 
Target
Name:
Induced myeloid leukemia cell differentiation protein Mcl-1
Synonyms:
BCL2L3 Bcl-2-like protein 3 (Mcl-1) Bcl2-L-3 MCL1 Mcl-1 Myeloid cell leukemia sequence 1 (BCL2-related) | mcl1/EAT
Type:
Membrane; Single-pass membrane protein
Mol. Mass.:
37332.87
Organism:
Homo sapiens (Human)
Description:
Q07820
Residue:
350
  
Inhibitor
Name:
BDBM38115
Synonyms:
3-(3-(4-chloro-3,5-dimethylphenoxy)propyl)-N-(phenylsulfonyl)-7-(3-(trifluoromethyl)pyridin-2-yl)-1H-indole-2-carboxamide US10844032, Example 102
Type:
Small organic molecule
Emp. Form.:
C32H27ClF3N3O4S
Mol. Mass.:
642.088
SMILES:
Cc1cc(OCCCc2c([nH]c3c(cccc23)-c2ncccc2C(F)(F)F)C(=O)NS(=O)(=O)c2ccccc2)cc(C)c1Cl
: