Target
Beta-secretase 1 [1-458]
Ligand
BDBM113274
Substrate
Meas. Tech.
BACE Enzyme Assay (Ex.434)
pH
4.5±n/a
Temperature
298.15±n/a K
IC50
505.8±n/a nM
Comments
extracted
Citation
 Cacatian, SClaremon, DADillard, LWFuchs, KHeine, NJia, LLeftheris, KMcKeever, BMorales-Ramos, ASingh, SBVenkatraman, SWu, GWu, ZXu, ZYuan, JZheng, Y Inhibitors of beta-secretase US Patent  US9212153 Publication Date 12/15/2015 
Target
Name:
Beta-secretase 1 [1-458]
Synonyms:
BACE BACE1_HUMAN KIAA1149
Type:
Mol. Mass.:
50753.53
Organism:
Homo sapiens (Human)
Description:
Truncation 1-458 aa with His-tag at C-terminus
Residue:
458
  
Inhibitor
Name:
BDBM113274
Synonyms:
US10336717, Compound 52 US9212153, 52
Type:
Small organic molecule
Emp. Form.:
C25H28N4O2
Mol. Mass.:
416.5154
SMILES:
COC1CCC2(CC1)CCc1ccc(cc1C21ON(C)C(N)=N1)-c1cccc(c1)C#N
: