Target
Beta-secretase 1 [1-458]
Ligand
BDBM195506
Substrate
Meas. Tech.
BACE Enzyme Assay (Ex.434)
pH
4.5±n/a
Temperature
298.15±n/a K
IC50
2.4±n/a nM
Comments
extracted
Citation
 Cacatian, SClaremon, DADillard, LWFuchs, KHeine, NJia, LLeftheris, KMcKeever, BMorales-Ramos, ASingh, SBVenkatraman, SWu, GWu, ZXu, ZYuan, JZheng, Y Inhibitors of beta-secretase US Patent  US9212153 Publication Date 12/15/2015 
Target
Name:
Beta-secretase 1 [1-458]
Synonyms:
BACE BACE1_HUMAN KIAA1149
Type:
Mol. Mass.:
50753.53
Organism:
Homo sapiens (Human)
Description:
Truncation 1-458 aa with His-tag at C-terminus
Residue:
458
  
Inhibitor
Name:
BDBM195506
Synonyms:
US10336717, Compound 99 | US9212153, 99,Ex. 65
Type:
Small organic molecule
Emp. Form.:
C22H25F2N3O2
Mol. Mass.:
401.4496
SMILES:
CN1OC2(N=C1N)c1cc(ccc1CC21CCC(CC1)OC(F)F)C#CC1CC1
: