Target
Beta-secretase 1 [1-458]
Ligand
BDBM195100
Substrate
Meas. Tech.
BACE Enzyme Assay (Ex.435)
pH
4.4±n/a
IC50
83.9±n/a nM
Comments
extracted
Citation
 Cacatian, SClaremon, DADillard, LWFuchs, KHeine, NJia, LLeftheris, KMcKeever, BMorales-Ramos, ASingh, SBVenkatraman, SWu, GWu, ZXu, ZYuan, JZheng, Y Inhibitors of beta-secretase US Patent  US9212153 Publication Date 12/15/2015 
Target
Name:
Beta-secretase 1 [1-458]
Synonyms:
BACE BACE1_HUMAN KIAA1149
Type:
Mol. Mass.:
50753.53
Organism:
Homo sapiens (Human)
Description:
Truncation 1-458 aa with His-tag at C-terminus
Residue:
458
  
Inhibitor
Name:
BDBM195100
Synonyms:
US10336717, Compound 159 | US9212153, 159,Ex. 122
Type:
Small organic molecule
Emp. Form.:
C27H33N3O4S
Mol. Mass.:
495.634
SMILES:
COC1CCC2(Cc3ccc(cc3C22N=C(N)N(C(C)C)C2=O)-c2cccc(c2)S(C)(=O)=O)CC1
: