Target
Beta-secretase 1 [1-458]
Ligand
BDBM195120
Substrate
Meas. Tech.
BACE Enzyme Assay (Ex.434)
pH
4.5±n/a
Temperature
298.15±n/a K
IC50
1.1±n/a nM
Comments
extracted
Citation
 Cacatian, SClaremon, DADillard, LWFuchs, KHeine, NJia, LLeftheris, KMcKeever, BMorales-Ramos, ASingh, SBVenkatraman, SWu, GWu, ZXu, ZYuan, JZheng, Y Inhibitors of beta-secretase US Patent  US9212153 Publication Date 12/15/2015 
Target
Name:
Beta-secretase 1 [1-458]
Synonyms:
BACE BACE1_HUMAN KIAA1149
Type:
Mol. Mass.:
50753.53
Organism:
Homo sapiens (Human)
Description:
Truncation 1-458 aa with His-tag at C-terminus
Residue:
458
  
Inhibitor
Name:
BDBM195120
Synonyms:
US9212153, 180,Ex. 141
Type:
Small organic molecule
Emp. Form.:
C26H25N5O2
Mol. Mass.:
439.509
SMILES:
COC1CCC2(Cc3ccc(cc3C22N=C(N)N(C)C2=O)-c2cc(cc(c2)[N+]#[C-])C#N)CC1
: