Target
Beta-secretase 1 [1-458]
Ligand
BDBM195143
Substrate
Meas. Tech.
BACE Enzyme Assay (Ex.434)
pH
4.5±n/a
Temperature
298.15±n/a K
IC50
4.9±n/a nM
Comments
extracted
Citation
 Cacatian, SClaremon, DADillard, LWFuchs, KHeine, NJia, LLeftheris, KMcKeever, BMorales-Ramos, ASingh, SBVenkatraman, SWu, GWu, ZXu, ZYuan, JZheng, Y Inhibitors of beta-secretase US Patent  US9212153 Publication Date 12/15/2015 
Target
Name:
Beta-secretase 1 [1-458]
Synonyms:
BACE BACE1_HUMAN KIAA1149
Type:
Mol. Mass.:
50753.53
Organism:
Homo sapiens (Human)
Description:
Truncation 1-458 aa with His-tag at C-terminus
Residue:
458
  
Inhibitor
Name:
BDBM195143
Synonyms:
US9212153, 205,Ex. 165
Type:
Small organic molecule
Emp. Form.:
C21H22F3N3O2
Mol. Mass.:
405.4135
SMILES:
COC1CCC2(Cc3ccc(cc3C22N=C(N)N(C)C2=O)C#CC(F)(F)F)CC1
: